Target
Thyroid peroxidase
Ligand
BDBM312265
Substrate
Meas. Tech.
Pharmacological Activity Assay
IC50
11000±n/a nM
Citation
 Inghardt, TBJohannesson, PJurva, UMichaelsson, ELindstedt-Alstermark, ETomkinson, NStonehouse, JPGan, L 1-[2-(aminomethyl)benzyl]-2-thioxo-1,2,3,5-tetrahydro-4H-pyrrolo[3,2-d]pyrimidin-4-ones as inhibitors of myeloperoxidase US Patent  US11000525 Publication Date 5/11/2021 
Target
Name:
Thyroid peroxidase
Synonyms:
PERT_HUMAN Thyroid peroxidase | Thyroid peroxidase (TPO)
Type:
Enzyme
Mol. Mass.:
102965.07
Organism:
Homo sapiens (Human)
Description:
P07202
Residue:
933
  
Inhibitor
Name:
BDBM312265
Synonyms:
1-{2-[(Methylamino)methyl]-4-(trifluoromethyl)benzyl}-2-thioxo-1,2,3,5-tetrahydro-4H-pyrrolo[3,2-d]pyrimidin-4-one US11000525, Example 15 | US9616063, 15
Type:
Small organic molecule
Emp. Form.:
C16H15F3N4OS
Mol. Mass.:
368.377
SMILES:
CNCc1cc(ccc1Cn1c2cc[nH]c2c(=O)[nH]c1=S)C(F)(F)F
: