Target
Tyrosine-protein kinase JAK2 [808-1132]
Ligand
BDBM103735
Substrate
Meas. Tech.
JAK2 Inhibition Assay
IC50
849±n/a nM
Citation
 Menet, CJSmits, KK Compound useful for the treatment of degenerative and inflammatory diseases US Patent  US11000528 Publication Date 5/11/2021 
Target
Name:
Tyrosine-protein kinase JAK2 [808-1132]
Synonyms:
JAK2 Janus kinase 2 (JAK2) Tyrosine-protein kinase JAK2 (808-1132)
Type:
Mol. Mass.:
37984.02
Organism:
Homo sapiens (Human)
Description:
808-1132 aa of O60674
Residue:
325
  
Inhibitor
Name:
BDBM103735
Synonyms:
US10206907, Compound 141 US8563545, 9
Type:
Small organic molecule
Emp. Form.:
C23H26N6O2
Mol. Mass.:
418.4915
SMILES:
CC(=O)N1CCN(Cc2ccc(cc2)-c2cccc3nc(NC(=O)C4CC4)nn23)CC1
: