Target
Lysine-specific demethylase 6B
Ligand
BDBM270506
Substrate
Meas. Tech.
In Vitro Enzyme Inhibition Assay
IC50
550±n/a nM
Citation
 Chen, YKWallace, MB Histone demethylase inhibitors US Patent  US11001568 Publication Date 5/11/2021 
Target
Name:
Lysine-specific demethylase 6B
Synonyms:
JMJD3 Jumonji domain-containing protein 3 KDM6B_HUMAN Lysine demethylase 6B Lysine-specific demethylase 6B (KDM6B(JMJD3)) | Lysine-specific demethylase 6B (KDM6B)
Type:
Protein
Mol. Mass.:
176672.55
Organism:
Homo sapiens (Human)
Description:
O15054
Residue:
1643
  
Inhibitor
Name:
BDBM270506
Synonyms:
3-[({(1S)-5-[2-methyl-4-(2,2,2-trifluoroethoxy)phenyl]isoindolinyl}methyl)amino]pyridine-4-carboxylic acid US11001568, Example 7A | US11731954, Example 7A
Type:
Small organic molecule
Emp. Form.:
C24H22F3N3O3
Mol. Mass.:
457.445
SMILES:
Cc1cc(OCC(F)(F)F)ccc1-c1ccc2[C@@H](CNc3cnccc3C(O)=O)NCc2c1
: