Target
Lysine-specific demethylase 5B
Ligand
BDBM270503
Substrate
Meas. Tech.
In Vitro Enzyme Inhibition Assay
IC50
<100±n/a nM
Citation
 Chen, YKWallace, MB Histone demethylase inhibitors US Patent  US11001568 Publication Date 5/11/2021 
Target
Name:
Lysine-specific demethylase 5B
Synonyms:
CT31 Histone demethylase JARID1B Jumonji/ARID domain-containing protein 1B KDM5B_HUMAN Lysine-specific demethylase 5B (KDM5Flag-5B-FL) PLU1 RBP2-H1 | Retinoblastoma-binding protein 2 homolog 1
Type:
Protein
Mol. Mass.:
175659.67
Organism:
Homo sapiens (Human)
Description:
Q9UGL1
Residue:
1544
  
Inhibitor
Name:
BDBM270503
Synonyms:
3-[({(1R)-5-[methyl(4-methylphenyl)amino]iso-indolinyl} methyl)amino]pyridine-4-carboxylic acid US11001568, Example 5B | US11731954, Example 5B
Type:
Small organic molecule
Emp. Form.:
C23H24N4O2
Mol. Mass.:
388.4623
SMILES:
CN(c1ccc(C)cc1)c1ccc2[C@H](CNc3cnccc3C(O)=O)NCc2c1
: