Target
Lysine-specific demethylase 5B
Ligand
BDBM270526
Substrate
Meas. Tech.
In Vitro Enzyme Inhibition Assay
IC50
<100±n/a nM
Citation
 Chen, YKWallace, MB Histone demethylase inhibitors US Patent  US11001568 Publication Date 5/11/2021 
Target
Name:
Lysine-specific demethylase 5B
Synonyms:
CT31 Histone demethylase JARID1B Jumonji/ARID domain-containing protein 1B KDM5B_HUMAN Lysine-specific demethylase 5B (KDM5Flag-5B-FL) PLU1 RBP2-H1 | Retinoblastoma-binding protein 2 homolog 1
Type:
Protein
Mol. Mass.:
175659.67
Organism:
Homo sapiens (Human)
Description:
Q9UGL1
Residue:
1544
  
Inhibitor
Name:
BDBM270526
Synonyms:
(R)-3-(((6-(2,6-dimethylphenyl)-2-methyl-1,2,3,4-tetra-hydroisoquinolin-1-yl)methyl)amino)isonicotinic acid US11001568, Example 17A | US11731954, Example 17A and 17B
Type:
Small organic molecule
Emp. Form.:
C25H27N3O2
Mol. Mass.:
401.5008
SMILES:
CN1CCc2cc(ccc2[C@@H]1CNc1cnccc1C(O)=O)-c1c(C)cccc1C
: