Target
Lysine-specific demethylase 6B
Ligand
BDBM270534
Substrate
Meas. Tech.
In Vitro Enzyme Inhibition Assay
IC50
5500±n/a nM
Citation
 Chen, YKWallace, MB Histone demethylase inhibitors US Patent  US11001568 Publication Date 5/11/2021 
Target
Name:
Lysine-specific demethylase 6B
Synonyms:
JMJD3 Jumonji domain-containing protein 3 KDM6B_HUMAN Lysine demethylase 6B Lysine-specific demethylase 6B (KDM6B(JMJD3)) | Lysine-specific demethylase 6B (KDM6B)
Type:
Protein
Mol. Mass.:
176672.55
Organism:
Homo sapiens (Human)
Description:
O15054
Residue:
1643
  
Inhibitor
Name:
BDBM270534
Synonyms:
(R)-3-(((2-methyl-5-(o-tolyl)isoindolin-1-yl)methyl)amino) isonicotinic acid US11001568, Example 21A | US11731954, Example 21A and 21B
Type:
Small organic molecule
Emp. Form.:
C23H23N3O2
Mol. Mass.:
373.4476
SMILES:
CN1Cc2cc(ccc2[C@@H]1CNc1cnccc1C(O)=O)-c1ccccc1C
: