Target
Plasma kallikrein
Ligand
BDBM408696
Substrate
Meas. Tech.
Inhibitory Activity Assay
IC50
740±n/a nM
Citation
 Davie, RLEdwards, HJEvans, DMHodgson, ST N-((HET)arylmethyl)-heteroaryl-carboxamides compounds as plasma kallikrein inhibitors US Patent  US11001578 Publication Date 5/11/2021 
Target
Name:
Plasma kallikrein
Synonyms:
Fletcher factor KLKB1 Kallikrein Plasma kallikrein heavy chain Plasma prekallikrein
Type:
Protein
Mol. Mass.:
71391.16
Organism:
Homo sapiens (Human)
Description:
P03952
Residue:
638
  
Inhibitor
Name:
BDBM408696
Synonyms:
N-[(5-chloro-2-fluorophenyl)methyl]-1-({4-[(4-methylpyrazol-1- yl)methyl]phenyl}methyl)-3-(trifluoromethyl)pyrazole-4-carboxamide US11001578, Example 20 US11198691, Example 20
Type:
Small organic molecule
Emp. Form.:
C24H20ClF4N5O
Mol. Mass.:
505.895
SMILES:
Cc1cnn(Cc2ccc(Cn3cc(C(=O)NCc4cc(Cl)ccc4F)c(n3)C(F)(F)F)cc2)c1
: