Target
Kallikrein-1
Ligand
BDBM408725
Substrate
Meas. Tech.
Inhibitory Activity Assay
IC50
>10000±n/a nM
Citation
 Davie, RLEdwards, HJEvans, DMHodgson, ST N-((HET)arylmethyl)-heteroaryl-carboxamides compounds as plasma kallikrein inhibitors US Patent  US11001578 Publication Date 5/11/2021 
Target
Name:
Kallikrein-1
Synonyms:
KLK1 Kallikrein 1 Kidney/pancreas/salivary gland kallikrein | Tissue kallikrein
Type:
Enzyme
Mol. Mass.:
28874.69
Organism:
Homo sapiens (Human)
Description:
P06870
Residue:
262
  
Inhibitor
Name:
BDBM408725
Synonyms:
N-[(5-chloro-1-benzothiophen-3-yl)methyl]-3-(methoxymethyl)-1-({4-[(4- methylpyrazol-1-yl)methyl]phenyl}methyl)pyrazole-4-carboxamide US11001578, Example 47 US11198691, Example 47
Type:
Small organic molecule
Emp. Form.:
C27H26ClN5O2S
Mol. Mass.:
520.046
SMILES:
COCc1nn(Cc2ccc(Cn3cc(C)cn3)cc2)cc1C(=O)NCc1csc2ccc(Cl)cc12
: