Target
Plasma kallikrein
Ligand
BDBM408737
Substrate
Meas. Tech.
Inhibitory Activity Assay
IC50
5780±n/a nM
Citation
 Davie, RLEdwards, HJEvans, DMHodgson, ST N-((HET)arylmethyl)-heteroaryl-carboxamides compounds as plasma kallikrein inhibitors US Patent  US11001578 Publication Date 5/11/2021 
Target
Name:
Plasma kallikrein
Synonyms:
Fletcher factor KLKB1 Kallikrein Plasma kallikrein heavy chain Plasma prekallikrein
Type:
Protein
Mol. Mass.:
71391.16
Organism:
Homo sapiens (Human)
Description:
P03952
Residue:
638
  
Inhibitor
Name:
BDBM408737
Synonyms:
3-amino-1-({4-[(2-oxopyridin-1-yl)methyl]phenyl}methyl)-N-{[4- (trifluoromethoxy)phenyl]methyl}pyrazole-4-carboxamide US11001578, Example 58 US11198691, Example 58
Type:
Small organic molecule
Emp. Form.:
C25H22F3N5O3
Mol. Mass.:
497.4691
SMILES:
Nc1nn(Cc2ccc(Cn3ccccc3=O)cc2)cc1C(=O)NCc1ccc(OC(F)(F)F)cc1
: