Target
Plasma kallikrein
Ligand
BDBM408749
Substrate
Meas. Tech.
Inhibitory Activity Assay
IC50
81.1±n/a nM
Citation
 Davie, RLEdwards, HJEvans, DMHodgson, ST N-((HET)arylmethyl)-heteroaryl-carboxamides compounds as plasma kallikrein inhibitors US Patent  US11001578 Publication Date 5/11/2021 
Target
Name:
Plasma kallikrein
Synonyms:
Fletcher factor KLKB1 Kallikrein Plasma kallikrein heavy chain Plasma prekallikrein
Type:
Protein
Mol. Mass.:
71391.16
Organism:
Homo sapiens (Human)
Description:
P03952
Residue:
638
  
Inhibitor
Name:
BDBM408749
Synonyms:
N-{[2-(difluoromethyl)phenyl]methyl}-3-(methoxymethyl)-1-({4-[(2-oxopyridin-1- yl)methyl]phenyl}methyl)pyrazole-4-carboxamide US11001578, Example 68 US11198691, Example 68
Type:
Small organic molecule
Emp. Form.:
C27H26F2N4O3
Mol. Mass.:
492.5171
SMILES:
COCc1nn(Cc2ccc(Cn3ccccc3=O)cc2)cc1C(=O)NCc1ccccc1C(F)F
: