Target
Kallikrein-1
Ligand
BDBM408779
Substrate
Meas. Tech.
Inhibitory Activity Assay
IC50
>40000±n/a nM
Citation
 Davie, RLEdwards, HJEvans, DMHodgson, ST N-((HET)arylmethyl)-heteroaryl-carboxamides compounds as plasma kallikrein inhibitors US Patent  US11001578 Publication Date 5/11/2021 
Target
Name:
Kallikrein-1
Synonyms:
KLK1 Kallikrein 1 Kidney/pancreas/salivary gland kallikrein | Tissue kallikrein
Type:
Enzyme
Mol. Mass.:
28874.69
Organism:
Homo sapiens (Human)
Description:
P06870
Residue:
262
  
Inhibitor
Name:
BDBM408779
Synonyms:
N-[(2-carbamoyl-5-methoxyphenyl)methyl]-3-(methoxymethyl)-1-({4-[(2-oxopyridin- 1-yl)methyl]phenyl}methyl)pyrazole-4-carboxamide US11001578, Example 86 US11198691, Example 86
Type:
Small organic molecule
Emp. Form.:
C28H29N5O5
Mol. Mass.:
515.5604
SMILES:
COCc1nn(Cc2ccc(Cn3ccccc3=O)cc2)cc1C(=O)NCc1cc(OC)ccc1C(N)=O
: