Target
Kallikrein-1
Ligand
BDBM408794
Substrate
Meas. Tech.
Inhibitory Activity Assay
IC50
>40000±n/a nM
Citation
 Davie, RLEdwards, HJEvans, DMHodgson, ST N-((HET)arylmethyl)-heteroaryl-carboxamides compounds as plasma kallikrein inhibitors US Patent  US11001578 Publication Date 5/11/2021 
Target
Name:
Kallikrein-1
Synonyms:
KLK1 Kallikrein 1 Kidney/pancreas/salivary gland kallikrein | Tissue kallikrein
Type:
Enzyme
Mol. Mass.:
28874.69
Organism:
Homo sapiens (Human)
Description:
P06870
Residue:
262
  
Inhibitor
Name:
BDBM408794
Synonyms:
N-[(3-ethyl-2-fluorophenyl)methyl]-3-(methoxymethyl)-1-({4-[(2-oxopyridin-1- yl)methyl]phenyl}methyl)pyrazole-4-carboxamide US11001578, Example 132 US11198691, Example 132
Type:
Small organic molecule
Emp. Form.:
C28H29FN4O3
Mol. Mass.:
488.5533
SMILES:
CCc1cccc(CNC(=O)c2cn(Cc3ccc(Cn4ccccc4=O)cc3)nc2COC)c1F
: