Target
Kallikrein-1
Ligand
BDBM408806
Substrate
Meas. Tech.
Inhibitory Activity Assay
IC50
>40000±n/a nM
Citation
 Davie, RLEdwards, HJEvans, DMHodgson, ST N-((HET)arylmethyl)-heteroaryl-carboxamides compounds as plasma kallikrein inhibitors US Patent  US11001578 Publication Date 5/11/2021 
Target
Name:
Kallikrein-1
Synonyms:
KLK1 Kallikrein 1 Kidney/pancreas/salivary gland kallikrein | Tissue kallikrein
Type:
Enzyme
Mol. Mass.:
28874.69
Organism:
Homo sapiens (Human)
Description:
P06870
Residue:
262
  
Inhibitor
Name:
BDBM408806
Synonyms:
3-amino-N-[(7-chloro-3,4-dihydro-2H-1,4-benzoxazin-2-yl)methyl]-1-({4-[(2- oxopyridin-1-yl)methyl]phenyl}methyl)pyrazole-4-carboxamide US11001578, Example 140 US11198691, Example 140
Type:
Small organic molecule
Emp. Form.:
C26H25ClN6O3
Mol. Mass.:
504.968
SMILES:
Nc1nn(Cc2ccc(Cn3ccccc3=O)cc2)cc1C(=O)NCC1CNc2ccc(Cl)cc2O1
: