Target
Dihydrofolate reductase
Ligand
BDBM82483
Substrate
Meas. Tech.
TBD
IC50
2.60±n/a nM
Citation
 Gangjee, A Pyrimidine compounds and pyrimido indole compounds and methods of use US Patent  US11001595 Publication Date 5/11/2021 
Target
Name:
Dihydrofolate reductase
Synonyms:
DHFR Dihydrofolate reductase (DHFR) | Tetrahydrofolate dehydrogenase
Type:
Enzyme
Mol. Mass.:
21453.99
Organism:
Homo sapiens (Human)
Description:
Recombinant human DHFR.
Residue:
187
  
Inhibitor
Name:
BDBM82483
Synonyms:
TMQ, R-(+) | US11001595, Compound TMQ
Type:
Small organic molecule
Emp. Form.:
C19H23NO5
Mol. Mass.:
345.3896
SMILES:
COc1cc(C[C@H]2NCCc3cc(O)c(O)cc23)cc(OC)c1OC
: