Target
Isocitrate dehydrogenase [NADP] cytoplasmic [R132C]
Ligand
BDBM497337
Substrate
Meas. Tech.
Biochemical Assay
IC50
15.6±n/a nM
Citation
 Bauer, RABoulet, SLBurkholder, TPHahn, PJRankovic, Z 7-phenylethylamino-4H-pyrimido[4,5-d][1,3]oxazin-2-one compounds as mutant IDH1 and IDH2 inhibitors US Patent  US11001596 Publication Date 5/11/2021 
Target
Name:
Isocitrate dehydrogenase [NADP] cytoplasmic [R132C]
Synonyms:
IDH1 IDH1(R132C) Isocitrate dehydrogenase (IDH1)(R132C) Isocitrate dehydrogenase [NADP] cytoplasmic (IDH1) (R132C) | PICD
Type:
Enzyme Catalytic Domain
Mol. Mass.:
46607.23
Organism:
Homo sapiens (Human)
Description:
O75874[R132C]
Residue:
414
  
Inhibitor
Name:
BDBM497337
Synonyms:
7-[[(1S)-1-[4-[2- Cyclopropyl-1-(4-prop-2- enoylpiperazin-1- yl)ethyl]phenyl]ethyl]amino]- 1-methyl-4H-pyrimido[4,5- d][1,3]oxazin-2-one, diastereomer 1 US11001596, Example 4 | US11629156, Example 3
Type:
Small organic molecule
Emp. Form.:
C27H34N6O3
Mol. Mass.:
490.5973
SMILES:
C[C@H](Nc1ncc2COC(=O)N(C)c2n1)c1ccc(cc1)[C@@H](CC1CC1)N1CCN(CC1)C(=O)C=C
: