Target
Isocitrate dehydrogenase [NADP] cytoplasmic [R132H]
Ligand
BDBM497351
Substrate
Meas. Tech.
Biochemical Assay
IC50
7.43±n/a nM
Citation
 Bauer, RABoulet, SLBurkholder, TPHahn, PJRankovic, Z 7-phenylethylamino-4H-pyrimido[4,5-d][1,3]oxazin-2-one compounds as mutant IDH1 and IDH2 inhibitors US Patent  US11001596 Publication Date 5/11/2021 
Target
Name:
Isocitrate dehydrogenase [NADP] cytoplasmic [R132H]
Synonyms:
Cytosolic NADP-isocitrate dehydrogenase (IDH1)(R132H) IDH1 R132H IDHC_HUMAN Isocitrate dehydrogenase 1 mutant (R132H) Isocitrate dehydrogenase [NADP] cytoplasmic (IDH1)(R132H) PICD
Type:
Protein
Mol. Mass.:
46641.74
Organism:
Homo sapiens (Human)
Description:
Human IDH1 R132H (SEQ ID No. 2 in patent). First three are removed. Google patent parsed wrong.
Residue:
414
  
Inhibitor
Name:
BDBM497351
Synonyms:
7-[[(1S)-1-[4-[2- Cyclopropyl-1-(4-prop-2- enoylpiperazin-1- yl)ethyl]phenyl]ethyl]amino]- 1-methyl-4H-pyrido[4,3- d][1,3]oxazin-2-one, isomer 1 US11001596, Example 9 | US11629156, Example 9
Type:
Small organic molecule
Emp. Form.:
C28H35N5O3
Mol. Mass.:
489.6092
SMILES:
C[C@H](Nc1cc2N(C)C(=O)OCc2cn1)c1ccc(cc1)[C@@H](CC1CC1)N1CCN(CC1)C(=O)C=C
: