Target
Isocitrate dehydrogenase [NADP] cytoplasmic [R132C]
Ligand
BDBM497355
Substrate
Meas. Tech.
Biochemical Assay
IC50
16.6±n/a nM
Citation
 Bauer, RABoulet, SLBurkholder, TPHahn, PJRankovic, Z 7-phenylethylamino-4H-pyrimido[4,5-d][1,3]oxazin-2-one compounds as mutant IDH1 and IDH2 inhibitors US Patent  US11001596 Publication Date 5/11/2021 
Target
Name:
Isocitrate dehydrogenase [NADP] cytoplasmic [R132C]
Synonyms:
IDH1 IDH1(R132C) Isocitrate dehydrogenase (IDH1)(R132C) Isocitrate dehydrogenase [NADP] cytoplasmic (IDH1) (R132C) | PICD
Type:
Enzyme Catalytic Domain
Mol. Mass.:
46607.23
Organism:
Homo sapiens (Human)
Description:
O75874[R132C]
Residue:
414
  
Inhibitor
Name:
BDBM497355
Synonyms:
1-Ethyl-7-[[(1S)-1-[4-[3-methoxy-1-(4-prop-2-enoylpiperazin-1-yl)propyl]phenyl]ethyl]amino]-4H-pyrimido[4,5-d][1,3]oxazin-2-one, diastereomer 1 US11001596, Example 14 | US11649247, Example 14
Type:
Small organic molecule
Emp. Form.:
C27H36N6O4
Mol. Mass.:
508.6125
SMILES:
CCN1C(=O)OCc2cnc(N[C@@H](C)c3ccc(cc3)C(CCOC)N3CCN(CC3)C(=O)C=C)nc12
: