Target
Complement factor D
Ligand
BDBM472455
Substrate
Meas. Tech.
Human Factor D Assay
IC50
<1000±n/a nM
Citation
 Wiles, JAPhadke, ASDeshpande, MAgarwal, AChen, DGadhachanda, VRHashimoto, APais, GWang, QWang, X Disubstituted compounds for treatment of medical disorders US Patent  US11001600 Publication Date 5/11/2021 
Target
Name:
Complement factor D
Synonyms:
Adipsin CFAD_HUMAN DF Properdin factor D
Type:
Protein
Mol. Mass.:
27039.19
Organism:
Homo sapiens (Human)
Description:
P00746
Residue:
253
  
Inhibitor
Name:
BDBM472455
Synonyms:
(2S,4R)-1-(2-(3- acetyl-5-(2-(S- methylsulfonimid oyl)pyrimidin-5- yl)-1H-indazol-1- yl)acetyl)-N-(6- bromopyridin-2-yl)-4- fluoropyrrolidine- 2-carboxamide US11001600, Cmp No. 46
Type:
Small organic molecule
Emp. Form.:
C26H24BrFN8O4S
Mol. Mass.:
643.487
SMILES:
CC(=O)c1nn(CC(=O)N2C[C@H](F)C[C@H]2C(=O)Nc2cccc(Br)n2)c2ccc(cc12)-c1cnc(nc1)S(C)(=N)=O
: