Target
fMet-Leu-Phe receptor
Ligand
BDBM497395
Substrate
Meas. Tech.
cAMP Assay
EC50
5000±n/a nM
Citation
 Shirude, PSChattopadhyay, AKRachamreddy, CWurtz, NRKick, EK Piperidinone formyl peptide 2 receptor agonists US Patent  US11008301 Publication Date 5/18/2021 
Target
Name:
fMet-Leu-Phe receptor
Synonyms:
FPR FPR1_HUMAN N-formyl peptide receptor 1 fMLP receptor formyl peptide receptor 1
Type:
Enzyme Catalytic Domain
Mol. Mass.:
38456.14
Organism:
Homo sapiens (Human)
Description:
gi_4503779
Residue:
350
  
Inhibitor
Name:
BDBM497395
Synonyms:
US11008301, Example 12
Type:
Small organic molecule
Emp. Form.:
C23H24F3N5O3
Mol. Mass.:
475.4636
SMILES:
FC(F)(F)c1ccc(NC(=O)N[C@@H]2CCCN(C2=O)c2ccc(cc2)N2CC3(COC3)C2)nc1
: