Target
N-formyl peptide receptor 2
Ligand
BDBM497405
Substrate
Meas. Tech.
cAMP Assay
EC50
14.0±n/a nM
Citation
 Shirude, PSChattopadhyay, AKRachamreddy, CWurtz, NRKick, EK Piperidinone formyl peptide 2 receptor agonists US Patent  US11008301 Publication Date 5/18/2021 
Target
Name:
N-formyl peptide receptor 2
Synonyms:
ALXR, FPRL1, FPR2 FPR2 FPRH1 Formyl Peptide Receptor-Like 1 LXA4 receptor Lipoxin A4 receptor RFP | hFPRL
Type:
G Protein-Coupled Receptor (GPCR)
Mol. Mass.:
38968.35
Organism:
Homo sapiens (Human)
Description:
P25090
Residue:
351
  
Inhibitor
Name:
BDBM497405
Synonyms:
US11008301, Example 69
Type:
Small organic molecule
Emp. Form.:
C25H28F3N5O3
Mol. Mass.:
503.5167
SMILES:
CC(=O)N[C@@H]1CCN(C1)c1ccc(cc1)N1CCC[C@@H](NC(=O)Nc2ccc(cc2)C(F)(F)F)C1=O
: