Target
N-formyl peptide receptor 2
Ligand
BDBM497413
Substrate
Meas. Tech.
cAMP Assay
EC50
2.60±n/a nM
Citation
 Shirude, PSChattopadhyay, AKRachamreddy, CWurtz, NRKick, EK Piperidinone formyl peptide 2 receptor agonists US Patent  US11008301 Publication Date 5/18/2021 
Target
Name:
N-formyl peptide receptor 2
Synonyms:
ALXR, FPRL1, FPR2 FPR2 FPRH1 Formyl Peptide Receptor-Like 1 LXA4 receptor Lipoxin A4 receptor RFP | hFPRL
Type:
G Protein-Coupled Receptor (GPCR)
Mol. Mass.:
38968.35
Organism:
Homo sapiens (Human)
Description:
P25090
Residue:
351
  
Inhibitor
Name:
BDBM497413
Synonyms:
US11008301, Example 107
Type:
Small organic molecule
Emp. Form.:
C24H26ClFN4O3
Mol. Mass.:
472.94
SMILES:
Fc1cc(ccc1N1CCC[C@@H](NC(=O)Nc2ccc(Cl)cc2)C1=O)N1C[C@@H]2CC[C@H](C1)O2
: