Target
Mitogen-activated protein kinase kinase kinase 5
Ligand
BDBM497494
Substrate
Meas. Tech.
HTRF KinEASE Assay
IC50
<1±n/a nM
Citation
 Wang, GShen, RGranger, BHe, JXing, XHe, YLong, JMa, JWang, BOr, YS Tetrazole containing apoptosis signal-regulating kinase 1 inhibitors and methods of use thereof US Patent  US11008304 Publication Date 5/18/2021 
Target
Name:
Mitogen-activated protein kinase kinase kinase 5
Synonyms:
ASK1 MAP3K5 MEKK5
Type:
Protein
Mol. Mass.:
154514.93
Organism:
Homo sapiens (Human)
Description:
Q99683
Residue:
1374
  
Inhibitor
Name:
BDBM497494
Synonyms:
US11008304, Example 80
Type:
Small organic molecule
Emp. Form.:
C24H28N8O3
Mol. Mass.:
476.5309
SMILES:
COc1cc(C)c(cc1C(=O)Nc1cccc(n1)-c1nnnn1[C@H](C)CO)-c1ccn(n1)C(C)C
: