Target
Mitogen-activated protein kinase kinase kinase 5
Ligand
BDBM497496
Substrate
Meas. Tech.
HTRF KinEASE Assay
IC50
5.5±n/a nM
Citation
 Wang, GShen, RGranger, BHe, JXing, XHe, YLong, JMa, JWang, BOr, YS Tetrazole containing apoptosis signal-regulating kinase 1 inhibitors and methods of use thereof US Patent  US11008304 Publication Date 5/18/2021 
Target
Name:
Mitogen-activated protein kinase kinase kinase 5
Synonyms:
ASK1 MAP3K5 MEKK5
Type:
Protein
Mol. Mass.:
154514.93
Organism:
Homo sapiens (Human)
Description:
Q99683
Residue:
1374
  
Inhibitor
Name:
BDBM497496
Synonyms:
US11008304, Example 82
Type:
Small organic molecule
Emp. Form.:
C24H23FN8O2
Mol. Mass.:
474.4902
SMILES:
Cc1cc(F)c(cc1-c1cnn(c1)C1CC1)C(=O)Nc1cccc(n1)-c1nnnn1[C@@H]1CCOC1
: