Target
Protein mono-ADP-ribosyltransferase PARP14
Ligand
BDBM434158
Substrate
Meas. Tech.
Enzymatic Assay
IC50
<1000±n/a nM
Citation
 Schenkel, LBVasbinder, MMKuntz, KWSwinger, KK Quinazolinones as PARP14 inhibitors US Patent  US11008308 Publication Date 5/18/2021 
Target
Name:
Protein mono-ADP-ribosyltransferase PARP14
Synonyms:
(ARTD8 or PARP14) 2.4.2.- ADP-ribosyltransferase diphtheria toxin-like 8 B aggressive lymphoma protein 2 BAL2  KIAA1268 PAR14_HUMAN PARP14 Synonyms=BAL2
Type:
Mol. Mass.:
202812.41
Organism:
Homo sapiens (Human)
Description:
Q460N5
Residue:
1801
  
Inhibitor
Name:
BDBM434158
Synonyms:
US10562891, Example 80 | US11008308, Example 80
Type:
Small organic molecule
Emp. Form.:
C19H20N4O2S
Mol. Mass.:
368.453
SMILES:
O=c1[nH]c(CSC2CCOCC2)nc2cc(Nc3cccnc3)ccc12
: