Target
Nuclear receptor ROR-gamma
Ligand
BDBM497656
Substrate
Meas. Tech.
In Vitro Ligand Binding Assay
IC50
4.20±n/a nM
Citation
 Bronner, SMCrawford, JJCridland, ACyr, PFauber, BGancia, EGobbi, AHurley, CKillen, JLee, WRene, OVan Niel, MBWard, SWinship, PZbieg, J Pyridazine derivatives as RORc modulators US Patent  US11008312 Publication Date 5/18/2021 
Target
Name:
Nuclear receptor ROR-gamma
Synonyms:
NR1F3 Nuclear receptor ROR-gamma (RORC) RAR-related orphan receptor C (RORc) RORG RZRG Retinoid-related orphan receptor-gamma (RORc)
Type:
Enzyme Catalytic Domain
Mol. Mass.:
58218.40
Organism:
Homo sapiens (Human)
Description:
P51449
Residue:
518
  
Inhibitor
Name:
BDBM497656
Synonyms:
(2S)-2-methyl-3-[4-[6-[(1S,8R)-5-(2,6- difluorophenyl)-11,11-dimethyl-3,4- diazatricyclo[6.2.1.02,7]undeca-2(7),3,5- trien-1-yl]-2-pyridyl]pyrazol-1- yl]propanamide | US11008312, Example 150
Type:
Small organic molecule
Emp. Form.:
C29H28F2N6O
Mol. Mass.:
514.569
SMILES:
C[C@H](Cn1cc(cn1)-c1cccc(n1)[C@@]12CC[C@@H](c3cc(nnc13)-c1c(F)cccc1F)C2(C)C)C(N)=O
: