Target
Nuclear receptor ROR-gamma
Ligand
BDBM497661
Substrate
Meas. Tech.
In Vitro Ligand Binding Assay
IC50
2.70±n/a nM
Citation
 Bronner, SMCrawford, JJCridland, ACyr, PFauber, BGancia, EGobbi, AHurley, CKillen, JLee, WRene, OVan Niel, MBWard, SWinship, PZbieg, J Pyridazine derivatives as RORc modulators US Patent  US11008312 Publication Date 5/18/2021 
Target
Name:
Nuclear receptor ROR-gamma
Synonyms:
NR1F3 Nuclear receptor ROR-gamma (RORC) RAR-related orphan receptor C (RORc) RORG RZRG Retinoid-related orphan receptor-gamma (RORc)
Type:
Enzyme Catalytic Domain
Mol. Mass.:
58218.40
Organism:
Homo sapiens (Human)
Description:
P51449
Residue:
518
  
Inhibitor
Name:
BDBM497661
Synonyms:
(1S,8R)-5-(2,6-difluorophenyl)-11,11- dimethyl-1-[6-(3-methyl-1H-pyrazol-4-yl)- 2-pyridyl]-3,4- diazatricyclo[6.2.1.02,7]undeca-2(7),3,5- triene | US11008312, Example 154
Type:
Small organic molecule
Emp. Form.:
C26H23F2N5
Mol. Mass.:
443.4911
SMILES:
Cc1n[nH]cc1-c1cccc(n1)[C@@]12CC[C@@H](c3cc(nnc13)-c1c(F)cccc1F)C2(C)C
: