Target
Tyrosine-protein kinase ITK/TSK
Ligand
BDBM497916
Substrate
Meas. Tech.
In Vitro Assay
IC50
<10±n/a nM
Citation
 Hudson, RBeausoleil, A Compounds and methods for modulating interleukin-2-inducible t-cell kinase US Patent  US11008314 Publication Date 5/18/2021 
Target
Name:
Tyrosine-protein kinase ITK/TSK
Synonyms:
EMT ITK_HUMAN LYK Tyrosine-protein kinase ITK Tyrosine-protein kinase Lyk
Type:
Protein
Mol. Mass.:
71839.20
Organism:
Homo sapiens (Human)
Description:
Q08881
Residue:
620
  
Inhibitor
Name:
BDBM497916
Synonyms:
US11008314, Compound 9
Type:
Small organic molecule
Emp. Form.:
C22H26N4O4S2
Mol. Mass.:
474.596
SMILES:
COc1cc(C)c(Sc2cnc(NC(C)=O)s2)cc1C(=O)N1CCN(C[C@@H]1C)C(=O)C=C
: