Target
D(2) dopamine receptor
Ligand
BDBM466549
Substrate
Meas. Tech.
Binding Activity Assay
Ki
80.0±n/a nM
Citation
 Yoshinaga, HUemachi, HOhno, TBesnard, J 2,6-disubstituted pyridine derivative US Patent  US11014905 Publication Date 5/25/2021 
Target
Name:
D(2) dopamine receptor
Synonyms:
D(2) dopamine receptor DOPAMINE D2 Long DRD2 Dopamine D2 receptor Dopamine D2 receptor (D2R) Dopamine2-like | d2
Type:
Cell-surface receptors
Mol. Mass.:
50647.10
Organism:
Homo sapiens (Human)
Description:
P14416
Residue:
443
  
Inhibitor
Name:
BDBM466549
Synonyms:
US10800755, Example 5 | US11014905, Example 5
Type:
Small organic molecule
Emp. Form.:
C19H31N3O2
Mol. Mass.:
333.4683
SMILES:
COCC(C)(C)C(=O)NCCN1CCC(CC1)c1cccc(C)n1
: