Target
D(4) dopamine receptor
Ligand
BDBM466550
Substrate
Meas. Tech.
Binding Activity Assay
Ki
101±n/a nM
Citation
 Yoshinaga, HUemachi, HOhno, TBesnard, J 2,6-disubstituted pyridine derivative US Patent  US11014905 Publication Date 5/25/2021 
Target
Name:
D(4) dopamine receptor
Synonyms:
D(2C) dopamine receptor DOPAMINE D4.2 DRD4 Dopamine D4 receptor
Type:
Enzyme
Mol. Mass.:
48373.19
Organism:
Homo sapiens (Human)
Description:
P21917
Residue:
419
  
Inhibitor
Name:
BDBM466550
Synonyms:
US10800755, Example 6 | US11014905, Example 6
Type:
Small organic molecule
Emp. Form.:
C19H28F3N3O2
Mol. Mass.:
387.4397
SMILES:
COCC(C)(C)C(=O)NCCN1CCC(CC1)c1cccc(n1)C(F)(F)F
: