Target
D(4) dopamine receptor
Ligand
BDBM466577
Substrate
Meas. Tech.
Binding Activity Assay
Ki
2.90±n/a nM
Citation
 Yoshinaga, HUemachi, HOhno, TBesnard, J 2,6-disubstituted pyridine derivative US Patent  US11014905 Publication Date 5/25/2021 
Target
Name:
D(4) dopamine receptor
Synonyms:
D(2C) dopamine receptor DOPAMINE D4.2 DRD4 Dopamine D4 receptor
Type:
Enzyme
Mol. Mass.:
48373.19
Organism:
Homo sapiens (Human)
Description:
P21917
Residue:
419
  
Inhibitor
Name:
BDBM466577
Synonyms:
2,2-Dimethyl-N-{2-[6-(trifluoromethyl)-3′,6′-dihydro[2,4′-bipyridin]-1′ (2′H)-yl]ethyl}propanamide US11014905, Example 31
Type:
Small organic molecule
Emp. Form.:
C18H24F3N3O
Mol. Mass.:
355.3979
SMILES:
CC(C)(C)C(=O)NCCN1CCC(=CC1)c1cccc(n1)C(F)(F)F
: