Target
D(4) dopamine receptor
Ligand
BDBM466578
Substrate
Meas. Tech.
Binding Activity Assay
Ki
96.0±n/a nM
Citation
 Yoshinaga, HUemachi, HOhno, TBesnard, J 2,6-disubstituted pyridine derivative US Patent  US11014905 Publication Date 5/25/2021 
Target
Name:
D(4) dopamine receptor
Synonyms:
D(2C) dopamine receptor DOPAMINE D4.2 DRD4 Dopamine D4 receptor
Type:
Enzyme
Mol. Mass.:
48373.19
Organism:
Homo sapiens (Human)
Description:
P21917
Residue:
419
  
Inhibitor
Name:
BDBM466578
Synonyms:
US10800755, Example 32 | US11014905, Example 32
Type:
Small organic molecule
Emp. Form.:
C18H26FN3O2
Mol. Mass.:
335.4163
SMILES:
Fc1cccc(n1)C1CCN(CCNC(=O)C2CCOCC2)CC1
: