Target
5-hydroxytryptamine receptor 1A
Ligand
BDBM466578
Substrate
Meas. Tech.
Binding Activity Assay
Ki
>10000±n/a nM
Citation
 Yoshinaga, HUemachi, HOhno, TBesnard, J 2,6-disubstituted pyridine derivative US Patent  US11014905 Publication Date 5/25/2021 
Target
Name:
5-hydroxytryptamine receptor 1A
Synonyms:
5-HT-1A 5-hydroxytryptamine receptor 1A (5-HT-1A) ADRB2RL1 Dopamine D2 receptor and serotonin 1a receptor HTR1A | Serotonin receptor 1A
Type:
Mol. Mass.:
46122.49
Organism:
Homo sapiens (Human)
Description:
Residue:
422
  
Inhibitor
Name:
BDBM466578
Synonyms:
US10800755, Example 32 | US11014905, Example 32
Type:
Small organic molecule
Emp. Form.:
C18H26FN3O2
Mol. Mass.:
335.4163
SMILES:
Fc1cccc(n1)C1CCN(CCNC(=O)C2CCOCC2)CC1
: