Target
D(2) dopamine receptor
Ligand
BDBM466582
Substrate
Meas. Tech.
Binding Activity Assay
Ki
132±n/a nM
Citation
 Yoshinaga, HUemachi, HOhno, TBesnard, J 2,6-disubstituted pyridine derivative US Patent  US11014905 Publication Date 5/25/2021 
Target
Name:
D(2) dopamine receptor
Synonyms:
D(2) dopamine receptor DOPAMINE D2 Long DRD2 Dopamine D2 receptor Dopamine D2 receptor (D2R) Dopamine2-like | d2
Type:
Cell-surface receptors
Mol. Mass.:
50647.10
Organism:
Homo sapiens (Human)
Description:
P14416
Residue:
443
  
Inhibitor
Name:
BDBM466582
Synonyms:
N-{2-[4-(6-Aminopyridin-2-yl)piperidin-1-yl]ethyl}-tetrahydro-2H-pyran-4-carboxamide US11014905, Example 36
Type:
Small organic molecule
Emp. Form.:
C18H28N4O2
Mol. Mass.:
332.4405
SMILES:
Nc1cccc(n1)C1CCN(CCNC(=O)C2CCOCC2)CC1
: