Target
D(1A) dopamine receptor
Ligand
BDBM160863
Substrate
Meas. Tech.
Receptor Binding Assay
Ki
224±n/a nM
Citation
 Brodney, MADavoren, JEDounay, ABEfremov, IVGray, DLGreen, MEHenderson, JLLee, CMente, SRO''Neil, SVRogers, BNZhang, L Heteroaromatic compounds and their use as dopamine D1 ligands US Patent  US11014909 Publication Date 5/25/2021 
Target
Name:
D(1A) dopamine receptor
Synonyms:
DA D1 receptor DRD1 Dopamine D1 receptor Dopamine D1A
Type:
Enzyme
Mol. Mass.:
49303.43
Organism:
Homo sapiens (Human)
Description:
P21728
Residue:
446
  
Inhibitor
Name:
BDBM160863
Synonyms:
US10093655, Example 33 US9107923, 33
Type:
Small organic molecule
Emp. Form.:
C21H21N3O4
Mol. Mass.:
379.4091
SMILES:
Cc1cc(Oc2ncccc2OC2CC2)ccc1-c1c(C)c(=O)[nH]c(=O)n1C
: