Target
Ubiquitin carboxyl-terminal hydrolase 30
Ligand
BDBM498851
Substrate
Meas. Tech.
Biochemical Assay
IC50
550±n/a nM
Citation
 Stockley, MLKemp, MIMadin, AWoodrow, MDJones, A Cyanopyrrolidine derivatives with activity as inhibitors of USP30 US Patent  US11014912 Publication Date 5/25/2021 
Target
Name:
Ubiquitin carboxyl-terminal hydrolase 30
Synonyms:
Deubiquitinating enzyme 30 USP30 Ubiquitin carboxyl-terminal hydrolase 30 (USP30) Ubiquitin-specific-processing protease 30
Type:
Protein
Mol. Mass.:
58522.90
Organism:
Homo sapiens (Human)
Description:
Q70CQ3
Residue:
517
  
Inhibitor
Name:
BDBM498851
Synonyms:
2-(1-Cyanopyrrolidin-3- ylidene)-N-methyl-N-((3- phenylisoxazol-5- yl)methyl)acetamide | US11014912, Example 27
Type:
Small organic molecule
Emp. Form.:
C18H18N4O2
Mol. Mass.:
322.3611
SMILES:
CN(Cc1cc(no1)-c1ccccc1)C(=O)C=C1CCN(C1)C#N
: