Target
Ubiquitin carboxyl-terminal hydrolase 30
Ligand
BDBM498878
Substrate
Meas. Tech.
Biochemical Assay
IC50
5.5±n/a nM
Citation
 Stockley, MLKemp, MIMadin, AWoodrow, MDJones, A Cyanopyrrolidine derivatives with activity as inhibitors of USP30 US Patent  US11014912 Publication Date 5/25/2021 
Target
Name:
Ubiquitin carboxyl-terminal hydrolase 30
Synonyms:
Deubiquitinating enzyme 30 USP30 Ubiquitin carboxyl-terminal hydrolase 30 (USP30) Ubiquitin-specific-processing protease 30
Type:
Protein
Mol. Mass.:
58522.90
Organism:
Homo sapiens (Human)
Description:
Q70CQ3
Residue:
517
  
Inhibitor
Name:
BDBM498878
Synonyms:
US11014912, Example 54
Type:
Small organic molecule
Emp. Form.:
C17H15F3N4O3
Mol. Mass.:
380.3212
SMILES:
FC(F)(F)Oc1cccc(c1)-c1cc(NC(=O)C[C@H]2CCN(C2)C#N)on1
: