Target
Fibroblast growth factor receptor 3
Ligand
BDBM357715
Substrate
Meas. Tech.
Enzymatic Assay
IC50
>200±n/a nM
Citation
 Lu, LWu, LQian, DYao, W Bicyclic heterocycles as FGFR4 inhibitors US Patent  US11014923 Publication Date 5/25/2021 
Target
Name:
Fibroblast growth factor receptor 3
Synonyms:
CD_antigen: CD333 FGFR3 Fibroblast growth factor receptor JTK4
Type:
Protein
Mol. Mass.:
87699.57
Organism:
Homo sapiens (Human)
Description:
P22607
Residue:
806
  
Inhibitor
Name:
BDBM357715
Synonyms:
(R)—N-((3-(2,6-difluoro-3,5-dimethoxyphenyl)-2-oxo-1-((tetrahydrofuran-3-yl)methyl)-1,2,3,4-tetrahydropyrido[4,3-d]pyrimidin-7-yl)methyl)acrylamide US10738048, Example 19 US11667635, Example 19 | US9890156, Example 19
Type:
Small organic molecule
Emp. Form.:
C24H26F2N4O5
Mol. Mass.:
488.4838
SMILES:
COc1cc(OC)c(F)c(N2Cc3cnc(CNC(=O)C=C)cc3N(C[C@H]3CCOC3)C2=O)c1F
: