Target
Fibroblast growth factor receptor 3
Ligand
BDBM357720
Substrate
Meas. Tech.
Enzymatic Assay
IC50
>200±n/a nM
Citation
 Lu, LWu, LQian, DYao, W Bicyclic heterocycles as FGFR4 inhibitors US Patent  US11014923 Publication Date 5/25/2021 
Target
Name:
Fibroblast growth factor receptor 3
Synonyms:
CD_antigen: CD333 FGFR3 Fibroblast growth factor receptor JTK4
Type:
Protein
Mol. Mass.:
87699.57
Organism:
Homo sapiens (Human)
Description:
P22607
Residue:
806
  
Inhibitor
Name:
BDBM357720
Synonyms:
N-((7-(2,6-difluoro-3,5-dimethoxyphenyl)-5,5-dimethyl-6-oxo-5,6,7,8-tetrahydro-2,7-naphthyridin-3-yl)methyl)acrylamide US10738048, Example 24 US11667635, Example 24 | US9890156, Example 24
Type:
Small organic molecule
Emp. Form.:
C22H23F2N3O4
Mol. Mass.:
431.4325
SMILES:
COc1cc(OC)c(F)c(N2Cc3cnc(CNC(=O)C=C)cc3C(C)(C)C2=O)c1F
: