Target
Fibroblast growth factor receptor 3
Ligand
BDBM357724
Substrate
Meas. Tech.
Enzymatic Assay
IC50
115±n/a nM
Citation
 Lu, LWu, LQian, DYao, W Bicyclic heterocycles as FGFR4 inhibitors US Patent  US11014923 Publication Date 5/25/2021 
Target
Name:
Fibroblast growth factor receptor 3
Synonyms:
CD_antigen: CD333 FGFR3 Fibroblast growth factor receptor JTK4
Type:
Protein
Mol. Mass.:
87699.57
Organism:
Homo sapiens (Human)
Description:
P22607
Residue:
806
  
Inhibitor
Name:
BDBM357724
Synonyms:
N-((1-cyclopentyl-3-(2,6-difluoro-3,5-dimethoxyphenyl)-2-oxo-1,2,3,4-tetrahydropyrido[4,3-d]pyrimidin-7-yl)methyl)acrylamide US10738048, Example 28 US11667635, Example 28 | US9890156, Example 28
Type:
Small organic molecule
Emp. Form.:
C24H26F2N4O4
Mol. Mass.:
472.4844
SMILES:
COc1cc(OC)c(F)c(N2Cc3cnc(CNC(=O)C=C)cc3N(C3CCCC3)C2=O)c1F
: