Target
MAP kinase-interacting serine/threonine-protein kinase 2
Ligand
BDBM498946
Substrate
Meas. Tech.
Biochemical Enzymatic Assay
IC50
55±n/a nM
Citation
 Sprengeler, PAReich, SHErnst, JTWebber, SE Pyrrolo-, pyrazolo-, imidazo-pyrimidine and pyridine compounds that inhibit MNK1 and MNK2 US Patent  US11014926 Publication Date 5/25/2021 
Target
Name:
MAP kinase-interacting serine/threonine-protein kinase 2
Synonyms:
GPRK7 MAP kinase-interacting serine/threonine-protein kinase 2 (MKNK2) MAP-kinase interacting kinase 2 (MNK2) MKNK2_HUMAN | MNK2
Type:
Protein
Mol. Mass.:
51870.79
Organism:
Homo sapiens (Human)
Description:
Q9HBH9
Residue:
465
  
Inhibitor
Name:
BDBM498946
Synonyms:
US11014926, Cpd. No. 17
Type:
Small organic molecule
Emp. Form.:
C15H11ClN4O
Mol. Mass.:
298.727
SMILES:
CC1NC(=O)c2c1cc(cc2Cl)-n1ccc2cncnc12
: