Target
Mitogen-activated protein kinase kinase kinase kinase 1
Ligand
BDBM498997
Substrate
Meas. Tech.
Kinase Binding Assay
Ki
<50±n/a nM
Citation
 Vechorkin, OLiu, KPan, JSokolsky, AYe, HFYe, QYao, WHummel, J Pyrazolopyrimidine compounds and uses thereof US Patent  US11014929 Publication Date 5/25/2021 
Target
Name:
Mitogen-activated protein kinase kinase kinase kinase 1
Synonyms:
HPK1 MAP4K1
Type:
PROTEIN
Mol. Mass.:
91316.07
Organism:
Homo sapiens (Human)
Description:
ChEMBL_586597
Residue:
833
  
Inhibitor
Name:
BDBM498997
Synonyms:
US11014929, Example 37 | US11542265, Example 37
Type:
Small organic molecule
Emp. Form.:
C24H25FN6O
Mol. Mass.:
432.4933
SMILES:
CCN1CCN(CC1)c1ccc(cc1)-c1n[nH]c2cnc(nc12)-c1c(F)cccc1OC
: