Target
Mitogen-activated protein kinase kinase kinase kinase 1
Ligand
BDBM499018
Substrate
Meas. Tech.
Kinase Binding Assay
Ki
<50±n/a nM
Citation
 Vechorkin, OLiu, KPan, JSokolsky, AYe, HFYe, QYao, WHummel, J Pyrazolopyrimidine compounds and uses thereof US Patent  US11014929 Publication Date 5/25/2021 
Target
Name:
Mitogen-activated protein kinase kinase kinase kinase 1
Synonyms:
HPK1 MAP4K1
Type:
PROTEIN
Mol. Mass.:
91316.07
Organism:
Homo sapiens (Human)
Description:
ChEMBL_586597
Residue:
833
  
Inhibitor
Name:
BDBM499018
Synonyms:
US11014929, Example 56 | US11542265, Example 56
Type:
Small organic molecule
Emp. Form.:
C25H26FN7
Mol. Mass.:
443.5192
SMILES:
CN1CCN(CC1)c1ccc(cc1)-c1n[nH]c2cnc(nc12)-c1c(F)ccc2CNCCc12
: