Target
Mitogen-activated protein kinase kinase kinase kinase 1
Ligand
BDBM499068
Substrate
Meas. Tech.
Kinase Binding Assay
Ki
<50±n/a nM
Citation
 Vechorkin, OLiu, KPan, JSokolsky, AYe, HFYe, QYao, WHummel, J Pyrazolopyrimidine compounds and uses thereof US Patent  US11014929 Publication Date 5/25/2021 
Target
Name:
Mitogen-activated protein kinase kinase kinase kinase 1
Synonyms:
HPK1 MAP4K1
Type:
PROTEIN
Mol. Mass.:
91316.07
Organism:
Homo sapiens (Human)
Description:
ChEMBL_586597
Residue:
833
  
Inhibitor
Name:
BDBM499068
Synonyms:
US11014929, Example 106 | US11542265, Example 106
Type:
Small organic molecule
Emp. Form.:
C26H28FN7
Mol. Mass.:
457.5458
SMILES:
CN1CCN(Cc2ccc(cc2)-c2n[nH]c3cnc(nc23)-c2c(F)ccc3CNCCc23)CC1
: