Target
CREB-binding protein
Ligand
BDBM437315
Substrate
Meas. Tech.
In Vitro CBP Inhibition
IC50
<500±n/a nM
Citation
 Trzoss, LBetancort, JMKanouni, TWallace, MBBoloor, A Therapeutic compounds US Patent  US11020380 Publication Date 6/1/2021 
Target
Name:
CREB-binding protein
Synonyms:
CBP CREB-binding protein (CBP) CREBBP
Type:
Transcription Coactivator
Mol. Mass.:
265411.66
Organism:
Homo sapiens (Human)
Description:
Q92793
Residue:
2442
  
Inhibitor
Name:
BDBM437315
Synonyms:
4-cyclobutoxy-1-methyl-5-(1-(1-phenylethyl)-1H- pyrazol-4-yl)pyridin-2(1H)-one US11020380, Example 49
Type:
Small organic molecule
Emp. Form.:
C21H23N3O2
Mol. Mass.:
349.4262
SMILES:
CC(c1ccccc1)n1cc(cn1)-c1cn(C)c(=O)cc1OC1CCC1
: