Target
CREB-binding protein
Ligand
BDBM437333
Substrate
Meas. Tech.
In Vitro CBP Inhibition
IC50
<500±n/a nM
Citation
 Trzoss, LBetancort, JMKanouni, TWallace, MBBoloor, A Therapeutic compounds US Patent  US11020380 Publication Date 6/1/2021 
Target
Name:
CREB-binding protein
Synonyms:
CBP CREB-binding protein (CBP) CREBBP
Type:
Transcription Coactivator
Mol. Mass.:
265411.66
Organism:
Homo sapiens (Human)
Description:
Q92793
Residue:
2442
  
Inhibitor
Name:
BDBM437333
Synonyms:
5-(1-benzyl-1H-pyrazol-4-yl)-1-methyl-4- morpholinopyridin-2(1H)-one US11020380, Example 67
Type:
Small organic molecule
Emp. Form.:
C20H22N4O2
Mol. Mass.:
350.4143
SMILES:
Cn1cc(-c2cnn(Cc3ccccc3)c2)c(cc1=O)N1CCOCC1
: