Target
CREB-binding protein
Ligand
BDBM437588
Substrate
Meas. Tech.
In Vitro CBP Inhibition
IC50
<500±n/a nM
Citation
 Trzoss, LBetancort, JMKanouni, TWallace, MBBoloor, A Therapeutic compounds US Patent  US11020380 Publication Date 6/1/2021 
Target
Name:
CREB-binding protein
Synonyms:
CBP CREB-binding protein (CBP) CREBBP
Type:
Transcription Coactivator
Mol. Mass.:
265411.66
Organism:
Homo sapiens (Human)
Description:
Q92793
Residue:
2442
  
Inhibitor
Name:
BDBM437588
Synonyms:
2-chloro-6-[4-[4-[2-(cyclopropylamino)pyrimidin-5-yl]-1- methyl-6-oxo-3-pyridyl]pyrazol-1-yl]benzonitrile US11020380, Example 322
Type:
Small organic molecule
Emp. Form.:
C23H18ClN7O
Mol. Mass.:
443.888
SMILES:
Cn1cc(-c2cnn(c2)-c2cccc(Cl)c2C#N)c(cc1=O)-c1cnc(NC2CC2)nc1
: