Target
Apelin receptor
Ligand
BDBM499482
Substrate
Meas. Tech.
[35S]GTPgammaS Binding
EC50
21.0±n/a nM
Citation
 Chen, YDransfield, PJHarvey, JSHeath, JAHouze, JKhakoo, AYKopecky, DJLai, SMa, ZNishimura, NPattaropong, VSwaminath, GYeh, WRamsden, PD Cycloalkyl substituted triazole compounds as agonists of the APJ receptor US Patent  US11020395 Publication Date 6/1/2021 
Target
Name:
Apelin receptor
Synonyms:
AGTRL1 APJ_HUMAN Angiotensin receptor-like 1 Apelin receptor (APJ) G-protein coupled receptor HG11
Type:
Enzyme Catalytic Domain
Mol. Mass.:
42664.06
Organism:
Homo sapiens (Human)
Description:
P35414
Residue:
380
  
Inhibitor
Name:
BDBM499482
Synonyms:
US11020395, Example 4.0
Type:
Small organic molecule
Emp. Form.:
C21H28N8O4S
Mol. Mass.:
488.563
SMILES:
COc1ncnc(OC)c1-n1c(NS(=O)(=O)[C@@H](C)[C@H](C)c2ncc(C)cn2)nnc1C1CCC1
: