Target
Apelin receptor
Ligand
BDBM499540
Substrate
Meas. Tech.
[35S]GTPgammaS Binding
EC50
340±n/a nM
Citation
 Chen, YDransfield, PJHarvey, JSHeath, JAHouze, JKhakoo, AYKopecky, DJLai, SMa, ZNishimura, NPattaropong, VSwaminath, GYeh, WRamsden, PD Cycloalkyl substituted triazole compounds as agonists of the APJ receptor US Patent  US11020395 Publication Date 6/1/2021 
Target
Name:
Apelin receptor
Synonyms:
AGTRL1 APJ_HUMAN Angiotensin receptor-like 1 Apelin receptor (APJ) G-protein coupled receptor HG11
Type:
Enzyme Catalytic Domain
Mol. Mass.:
42664.06
Organism:
Homo sapiens (Human)
Description:
P35414
Residue:
380
  
Inhibitor
Name:
BDBM499540
Synonyms:
US11020395, Example 136.0 | US11020395, Example 137.0
Type:
Small organic molecule
Emp. Form.:
C18H27ClN6O4S
Mol. Mass.:
458.963
SMILES:
CO[C@@H]([C@H](C)S(=O)(=O)Nc1nnc([C@H]2C[C@H](CO)C2)n1C(C)C)c1ncc(Cl)cn1
: