Target
Apelin receptor
Ligand
BDBM499544
Substrate
Meas. Tech.
[35S]GTPgammaS Binding
EC50
31.0±n/a nM
Citation
 Chen, YDransfield, PJHarvey, JSHeath, JAHouze, JKhakoo, AYKopecky, DJLai, SMa, ZNishimura, NPattaropong, VSwaminath, GYeh, WRamsden, PD Cycloalkyl substituted triazole compounds as agonists of the APJ receptor US Patent  US11020395 Publication Date 6/1/2021 
Target
Name:
Apelin receptor
Synonyms:
AGTRL1 APJ_HUMAN Angiotensin receptor-like 1 Apelin receptor (APJ) G-protein coupled receptor HG11
Type:
Enzyme Catalytic Domain
Mol. Mass.:
42664.06
Organism:
Homo sapiens (Human)
Description:
P35414
Residue:
380
  
Inhibitor
Name:
BDBM499544
Synonyms:
US11020395, Example 140.0
Type:
Small organic molecule
Emp. Form.:
C25H34N6O5S
Mol. Mass.:
530.64
SMILES:
COc1cccc(OC)c1-n1c(NS(=O)(=O)[C@@H](C)[C@@H](OC(C)C)c2cnc(C)cn2)nnc1C1CCC1
: