Target
Apelin receptor
Ligand
BDBM499611
Substrate
Meas. Tech.
[35S]GTPgammaS Binding
EC50
18.0±n/a nM
Citation
 Chen, YDransfield, PJHarvey, JSHeath, JAHouze, JKhakoo, AYKopecky, DJLai, SMa, ZNishimura, NPattaropong, VSwaminath, GYeh, WRamsden, PD Cycloalkyl substituted triazole compounds as agonists of the APJ receptor US Patent  US11020395 Publication Date 6/1/2021 
Target
Name:
Apelin receptor
Synonyms:
AGTRL1 APJ_HUMAN Angiotensin receptor-like 1 Apelin receptor (APJ) G-protein coupled receptor HG11
Type:
Enzyme Catalytic Domain
Mol. Mass.:
42664.06
Organism:
Homo sapiens (Human)
Description:
P35414
Residue:
380
  
Inhibitor
Name:
BDBM499611
Synonyms:
US11020395, Example 209.0
Type:
Small organic molecule
Emp. Form.:
C24H30F2N6O5S
Mol. Mass.:
552.594
SMILES:
COc1cccc(OC)c1-n1c(NS(=O)(=O)[C@@H](C)[C@H](OCC(F)F)c2ncc(C)cn2)nnc1C1CCC1
: